This forum provides solutions for aws developers for their issues.It provides solutions for aws elastic ip, ec2 instance, public ip,route53 pricing, load balancers in aws,Orchestration, ebs,, lambda, installing mongodb on ubuntu etc.

Saturday, 21 April 2018

sudo -u keycloak ./jboss-cli.sh 'embed-server,/subsystem=undertow/server=default-server/http-listener=default:write-attribute(name=proxy-address-forwarding,value=true)'Cannot start embedded server: Failed to instantiate class "org.jboss.logmanager.handlers.PeriodicRotatingFileHandler" for handler "FILE": java.lang.reflect.InvocationTargetException: /opt/keycloak-3.4.3.Final/standalone/log/server.log...

https required keycloak

Keycloak admin login page not showing without https . Disable https in the dashboard, but without logging in, we cannot disable. So use the below commands go to bin folder of keycloak. ./kcadm.sh config credentials --server http://localhost:8080/auth --realm master --user admin ./kcadm.sh update realms/realmname -s sslRequired=NON...

Saturday, 14 April 2018

https: Address already in use /0.0.0.0:8443

18:02:14,277 ERROR [org.jboss.msc.service.fail] (MSC service thread 1-1) MSC000001: Failed to start service org.wildfly.undertow.listener.https: org.jboss.msc.service.StartException in service org.wildfly.undertow.listener.https: Address already in use /0.0.0.0:8443    at org.wildfly.extension.undertow//org.wildfly.extension.undertow.ListenerService.start(ListenerService.java:179)  ...

PPK to Pem Conversion in Mac

PPK to PEM conversion in MACputtygen privatekey.ppk -O private-openssh -o privatekey.pe...

Wednesday, 11 April 2018

No compiler is provided in this environment. Perhaps you are running on a JRE rather than a JDK?

[INFO] BUILD FAILURE [INFO] ------------------------------------------------------------------------ [INFO] Total time: 47.995 s [INFO] Finished at: 2018-04-11T12:51:26+00:00 [INFO] Final Memory: 210M/483M [INFO] ------------------------------------------------------------------------ [ERROR] Failed to execute goal org.apache.maven.plugins:maven-compiler-plugin:3.1:compile (default-compile) on project...

Sunday, 1 April 2018

php 5.5.9 Uncaught exception 'PusherException'

PHP Fatal error:  Uncaught exception 'PusherException' with message 'There is missing dependant extensions - please ensure both cURL and JSON modules are installe...

Labels

Online Training

Your Name :
Your Email: (required)
Your Message: (required)

Powered by Blogger.

Recent Posts

Find Us On Facebook

Popular Posts